发表评论取消回复
相关阅读
相关 解决Error:403 No valid crumb was included in the request
Jenkins错误备忘:Error:403 No valid crumb was included in the request 在Jenkins上创建流水线后不能sav
相关 Vue项目启动报错Error: No PostCSS Config found in …
前言: > 前不久在项目拉取到新的环境时遇到了一个新的问题,项目在启动时报出了`Error: No PostCSS Config found in …`
相关 configure: error: no acceptable C compiler found in $PATH
今天安装yasm遇到configure: error: no acceptable C compiler found in $PATH这个报错,原因是缺少gcc。 执行以下命
相关 Error in sasl_client_start (-4) SASL(-4): no mechanism available: No worthy mechs found
cdh或者hdp增加kerberos验证后,python链接大数据集群的调用都需要增加认证这一个环节: 如下报错的解决方案: thriftpy.transp
相关 java.io.IOException: No error in nativeavailable
1、错误描述 java.io.IOException: No error in nativeavailable at gnu.io.RXTXPort.nat
相关 No repository found error in Installing ADT in eclipse 解决方法
问题: An error occurred while collecting items to be installed session context wa
相关 FATAL ERROR in native method: JDWP No transports initialized
1、错误描述 FATAL ERROR in native method: JDWP No transports initialized, jvmtiError=AGE
相关 npm 报错 Module build failed: Error: No PostCSS Config found in:
自己想吧以前的项目复制粘贴到现在的一个项目文件夹里,但是有些文件是会被忽略的,所以,我用vscode打开文件,把一些英超那个文件拖过来了,但是运行的时候还是会报如下的错: [
相关 [ERROR] No plugin found for prefix 'docker' in the current project and in the plugin groups
错误内容: [ERROR] No plugin found for prefix 'docker' in the current project and in the
相关 LibClamAV Error: cli_loaddb(): No supported database files found in /var/lib/clamav/ ERROR: Can't op
LibClamAV Error: cli\_loaddb(): No supported database files found in /var/lib/clamav/
还没有评论,来说两句吧...